{"text_format":"1","workbook":"xlsx","n_sheets":9,"sheets":["ConCal","CheatSheet","SiteRules","DeBug","Protocols","SizeImages","weight2Volume","mappings","about"],"not_rendered":{"charts":0,"images":13,"macros":1,"external_links":0,"defined_names":1,"comments":0,"pivot_tables":0},"unopened":[],"bounds":{"document_bytes":16777216,"sheet_cells":100000,"rows_first":2000,"rows_last":500,"rows_between":2000,"halvings":0,"cell_chars":16384,"cell_head_chars":4096},"cells_cut":0,"cells_raw":0,"read":"whole","date_system":"1900"}

{"sheet":"ConCal","index":0,"n_rows":40,"n_cols":6,"rows_kept":40,"cut":false,"hidden":false,"merged":[[7,4,7,6],[1,3,3,4],[6,2,6,6],[1,5,3,6],[0,0,4,0],[0,5,0,6],[4,5,5,6],[4,3,5,4],[4,1,5,2],[0,1,0,2],[0,3,0,4],[1,1,3,2],[28,0,28,6],[15,0,15,6],[19,1,19,5],[20,0,20,6],[21,0,21,6],[8,4,8,6],[12,3,12,6],[13,4,13,5],[13,2,13,3],[9,4,9,6]]}
[null,"Contrast Volume",null,"Chaser Volume",null,"Injection rate"]
[null,{"$f":"IF(AND(DeBug!A6<=SiteRules!B5,DeBug!A6>=SiteRules!B6),DeBug!A6,IF(DeBug!A6>SiteRules!B5,SiteRules!B5,SiteRules!B6))","v":69},null,{"$f":"VLOOKUP(A8,Protocols!A6:B100,2,FALSE)","v":50},null,{"$f":"IF(AND(DeBug!A10<=SiteRules!B3,DeBug!A10>=SiteRules!B4),DeBug!A10,IF(DeBug!A6>SiteRules!B3,SiteRules!B3,SiteRules!B4))","v":3}]
[]
[]
[null,"ml or cc",null,"ml or cc",null,"ml/s or cc/s"]
[]
["Protocol Name/type [select from list]"]
["Weight Based Routine Adult"]
[null,null,null,null,"Patient Is roughly a"]
["Patient Weight [free text]",null,null,null,{"$f":"IF(IF(DeBug!A13=2,ConCal!A11,ConCal!A11*0.453592)<11,\"newborn or baby\",\n\nIF(IF(DeBug!A13=2,ConCal!A11,ConCal!A11*0.453592)<30,\"toddler or child\",\nIF(IF(DeBug!A13=2,ConCal!A11,ConCal!A11*0.453592)<40,\"teen\",\nIF(IF(DeBug!A13=2,ConCal!A11,ConCal!A11*0.453592)<50,\"small adult\",\nIF(IF(DeBug!A13=2,ConCal!A11,ConCal!A11*0.453592)<68,\"average adult\",\nIF(IF(DeBug!A13=2,ConCal!A11,ConCal!A11*0.453592)<80,\"slightly large adult\",\nIF(IF(DeBug!A13=2,ConCal!A11,ConCal!A11*0.453592)<94,\"obese adult\",\"very obese adult\")))))))","v":"average adult"}]
[131]
[]
["Concentration (mgI/cc or mgI/ml) [select from list]"]
[350]
[]
["Simple conversion calculations"]
[]
[null,"This volume","at this strength","equals","This volume","at this strength"]
[]
[null,"Conserves total Iodine load"]
["Contrast delivery dynamics section"]
["Use this section to ensure you are not still injecting contrast while scanning"]
["Scan Delay (seconds) [free text]"]
[60]
["Your scan will start ",{"$f":"A24-B27","v":37},"seconds after contrast agent has finished injecting"]
["Your total (contrast + chaser) injection time is ",{"$f":"ROUND(B2/F2+(D2-B28)/F2,0)","v":33},"seconds"]
["You will inject contrast for ",{"$f":"ROUND(B2/F2,0)","v":23},"seconds"]
["We assume ",20,"(ml or cc) of chaser will be used for a test injection"]
["Copyright 2020 University of Wisconsin Department of Radiology, Tim Szczykutowicz Ph.D."]
[]
[]
[]
[]
[]
[]
[]
[]
[]
[]
[446]

{"sheet":"CheatSheet","index":1,"n_rows":20,"n_cols":4,"rows_kept":20,"cut":false,"hidden":false,"merged":[]}
[]
[]
[null,null,"If your protocol says to use 300 but you have 350"]
[null,null,"Volume at 300","Volume at 350"]
[null,null,50,{"$f":"ROUND(C5*300/350,0)","v":43}]
[null,null,75,{"$f":"ROUND(C6*300/350,0)","v":64}]
[null,null,100,{"$f":"ROUND(C7*300/350,0)","v":86}]
[null,null,125,{"$f":"ROUND(C8*300/350,0)","v":107}]
[null,null,150,{"$f":"ROUND(C9*300/350,0)","v":129}]
[]
[]
[]
[]
[null,null,"If your protocol says to use 370 but you have 350"]
[null,null,"Volume at 370","Volume at 350"]
[null,null,50,{"$f":"ROUND(C16*370/350,0)","v":53}]
[null,null,75,{"$f":"ROUND(C17*370/350,0)","v":79}]
[null,null,100,{"$f":"ROUND(C18*370/350,0)","v":106}]
[null,null,125,{"$f":"ROUND(C19*370/350,0)","v":132}]
[null,null,150,{"$f":"ROUND(C20*370/350,0)","v":159}]

{"sheet":"SiteRules","index":2,"n_rows":6,"n_cols":4,"rows_kept":6,"cut":false,"hidden":false,"merged":[]}
["Limits for fields"]
[null,null,null,"only edit the spaces inside the gray boxes"]
["max flow rate (ml/s or cc/s)",5.5,null,"these should reflect site specific rules for all protocols"]
["min flow rate (ml/s or cc/s)",0.5]
["max contrast volume (ml or cc)",150]
["min contrast volume (ml or cc)",5]

{"sheet":"DeBug","index":3,"n_rows":25,"n_cols":13,"rows_kept":25,"cut":false,"hidden":false,"merged":[]}
[]
[]
["calculations tab",null,null,null,null,null,null,null,null,null,null,{"$f":"VLOOKUP(IF(DeBug!A13=2,ConCal!A11,ConCal!A11*0.453592),INDIRECT(VLOOKUP(VLOOKUP(ConCal!$A$8,mappings!H3:I102,2,FALSE),mappings!A3:B102,2,FALSE)),{2,3},TRUE)","v":80.287300000000002},{"$f":"VLOOKUP(VLOOKUP(ConCal!$A$8,mappings!H3:I102,2,FALSE),mappings!A3:E102,{4,5},FALSE)","v":0}]
[]
["volume we calculate (may not actually be displayed based on user siterules",null,null,null,null,null,null,null,null,null,null,{"$f":"_xlfn.FORECAST.LINEAR(ConCal!E14,VLOOKUP(IF(DeBug!A13=2,ConCal!A11,ConCal!A11*0.453592),INDIRECT(VLOOKUP(VLOOKUP(ConCal!$A$8,mappings!H3:I102,2,FALSE),mappings!A3:B102,2,FALSE)),{2,3},TRUE),VLOOKUP(VLOOKUP(ConCal!$A$8,mappings!H3:I102,2,FALSE),mappings!A3:E102,{4,5},FALSE))","v":{"$error":"#REF!"}}]
[{"$f":"IF(VLOOKUP(ConCal!A8,Protocols!A6:D100,4,FALSE)=1,\n\nROUND(IF(ConCal!E14>=VLOOKUP(VLOOKUP(ConCal!$A$8,mappings!H3:I102,2,FALSE),mappings!A3:D102,4,FALSE),VLOOKUP(ROUND(IF(DeBug!A13=2,ConCal!A11,ConCal!A11*0.453592),1),INDIRECT(VLOOKUP(VLOOKUP(ConCal!A8,mappings!H3:I102,2,FALSE),mappings!A3:B102,2,FALSE)),2,TRUE)/ConCal!A14*VLOOKUP(VLOOKUP(ConCal!A8,mappings!H3:I102,2,FALSE),mappings!A3:C102,3,FALSE),IF(ConCal!E14<=VLOOKUP(VLOOKUP(ConCal!$A$8,mappings!H3:I102,2,FALSE),mappings!A3:E102,5,FALSE),VLOOKUP(ROUND(IF(DeBug!A13=2,ConCal!A11,ConCal!A11*0.453592),1),INDIRECT(VLOOKUP(VLOOKUP(ConCal!A8,mappings!H3:I102,2,FALSE),mappings!A3:B102,2,FALSE)),3,TRUE)/ConCal!A14*VLOOKUP(VLOOKUP(ConCal!A8,mappings!H3:I102,2,FALSE),mappings!A3:C102,3,FALSE),_xlfn.FORECAST.LINEAR(ConCal!E14,VLOOKUP(IF(DeBug!A13=2,ConCal!A11,ConCal!A11*0.453592),INDIRECT(VLOOKUP(VLOOKUP(ConCal!$A$8,mappings!H3:I102,2,FALSE),mappings!A3:B102,2,FALSE)),{2,3},TRUE),VLOOKUP(VLOOKUP(ConCal!$A$8,mappings!H3:I102,2,FALSE),mappings!A3:E102,{4,5},FALSE)))),0),\n\nROUND(VLOOKUP(ROUND(IF(DeBug!A13=2,ConCal!A11,ConCal!A11*0.453592),1),INDIRECT(VLOOKUP(VLOOKUP(ConCal!A8,mappings!H3:I102,2,FALSE),mappings!A3:B102,2,FALSE)),2,TRUE)/ConCal!A14*VLOOKUP(VLOOKUP(ConCal!A8,mappings!H3:I102,2,FALSE),mappings!A3:C102,3,FALSE),0))","v":69}]
[]
[]
["flow rate we calculate (may not actually be displayed based on user siterules"]
[{"$f":"IF(VLOOKUP(ConCal!A8,Protocols!A6:D100,4,FALSE)=1,\n\nROUND(IF(ConCal!B2/ConCal!E14<VLOOKUP(IF(DeBug!A13=2,ConCal!A11,ConCal!A11*0.453592),INDIRECT(VLOOKUP(VLOOKUP(ConCal!$A$8,mappings!H3:I102,2,FALSE),mappings!A3:B102,2,FALSE)),4,TRUE),ConCal!B2/ConCal!E14,VLOOKUP(IF(DeBug!A13=2,ConCal!A11,ConCal!A11*0.453592),INDIRECT(VLOOKUP(VLOOKUP(ConCal!$A$8,mappings!H3:I102,2,FALSE),mappings!A3:B102,2,FALSE)),4,TRUE)),1),\n\nIF(VLOOKUP(ConCal!A8,Protocols!A6:E100,5,FALSE)=3,VLOOKUP(IF(DeBug!A13=2,ConCal!A11,ConCal!A11*0.453592),INDIRECT(VLOOKUP(VLOOKUP(ConCal!$A$8,mappings!H3:I102,2,FALSE),mappings!A3:B102,2,FALSE)),3,TRUE),VLOOKUP(ConCal!$A$8,Protocols!A6:C100,3,FALSE)))","v":3}]
[]
["this cell below is where the radio buttons link to, 1 is lbs, 2 is kg"]
[1]
[]
[]
[]
["the cell below is 1 when the protocol selected is an angio protocol"]
[{"$f":"VLOOKUP(ConCal!A8,Protocols!A6:D100,4,FALSE)","v":0}]
[]
[]
["this is where the \"special flag\" output goes"]
[{"$f":"VLOOKUP(ConCal!A8,Protocols!A6:E100,5,FALSE)","v":1}]
[]
["patient weight in kg"]
[{"$f":"IF(DeBug!A13=2,ConCal!A11,ConCal!A11*0.453592)","v":59.420552000000001}]

{"sheet":"Protocols","index":4,"n_rows":9,"n_cols":9,"rows_kept":9,"cut":false,"hidden":false,"merged":[[3,0,3,3],[0,0,2,4]]}
["Special flags: 1= a protocol that needs to have the default wieght choice moved to lbs, 2 = a protocol that needs to have the default weight choice moved to kg, 3 = a protocol that has changing flow rate with weight but is not a angio protocol"]
[]
[]
["all of these parms go together",null,null,null,null,null,null,null,"this list just populates the choices for IV constrast strength, values here have NO correspondence with the left side of this sheet"]
["Names of protocols and protocol types (up to 100)","Chaser amount for saline (cc or ml)","Default Flow Rate (ml/s or cc/s)\n(blank if angio flag is 1)","Angio protocol?","special flags",null,null,null,"Contrast Strength"]
["Weight Based Routine Adult",50,3,null,1,null,null,null,300]
["Weight Based Routine Ped",30,1.5,null,2,null,null,null,320]
["Weight Based Angio",60,null,1,1,null,null,null,350]
["U Washington Abdomen",50,null,null,3,null,null,null,370]

{"sheet":"SizeImages","index":5,"n_rows":8,"n_cols":6,"rows_kept":8,"cut":false,"hidden":false,"merged":[]}
["newborn or baby",null,null,null,null,{"$f":"IFS(IF(A33=2,C8,C8*0.453592)<20,\"newborn or baby\",IF(A33=2,C8,C8*0.453592)<40,\"toddler or child\",IF(A33=2,C8,C8*0.453592)<80,\"teen\",IF(A33=2,C8,C8*0.453592)<100,\"small adult\",IF(A33=2,C8,C8*0.453592)<120,\"average adult\",IF(A33=2,C8,C8*0.453592)<150,\"slightly large adult\",IF(A33=2,C8,C8*0.453592)<200,\"obese adult\",IF(A33=2,C8,C8*0.453592)<250,\"very obese adult\")","v":{"$error":"#NAME?"}}]
["toddler or child"]
["teen"]
["small adult"]
["average adult"]
["slightly large adult"]
["obese adult"]
["very obese adult"]

{"sheet":"weight2Volume","index":6,"n_rows":425,"n_cols":25,"rows_kept":425,"cut":false,"hidden":false,"merged":[[5,4,5,6]]}
[]
[]
["Here we list tables of weight (kg and lbs ) to contrast volume in mg I /cc"]
["We anticipate we can have more than one protocol name/type using the same look up table, so use the tab labelled \"mapping\" to map protocol names/types to LUT ranges"]
[]
[null,null,null,null,"LUT 2 (uses 2 ml/kg 0-40, 80 40-65 than p3t above 65kg)",null,null,null,"LUT 3",null,null,null,"LUT 4 (based on p3ta <88 lbs, 350 conc)",null,null,null,null,"LUT5 (uwash body) at 350 conc"]
[null,null,null,null,"lbs","kg","volume",null,"kg","volume",null,"lbs","kg","max volume","min volume","rate max",null,"lbs","kg","volume ","rate"]
[null,null,null,null,0,{"$f":"E8*0.453592","v":0},{"$f":"2*F8","v":0},null,0,100,null,0,{"$f":"L8*0.453592","v":0},57,46,3.6,null,0,{"$f":"R8*0.453592","v":0},100,2]
[null,null,null,null,1,0.453592,{"$f":"2*F9","v":0.90718399999999999},null,1,100,null,1,{"$f":"L9*0.453592","v":0.453592},57,46,3.6,null,1,{"$f":"R9*0.453592","v":0.453592},100,2]
[null,null,null,null,2,0.90718399999999999,1.814368,null,2,100,null,2,0.90718399999999999,57,46,3.6,null,2,0.90718399999999999,100,2]
[null,null,null,null,3,1.360776,2.721552,null,3,100,null,3,1.360776,57,46,3.6,null,3,1.360776,100,2]
[null,null,null,null,4,1.814368,3.628736,null,4,100,null,4,1.814368,57,46,3.6,null,4,1.814368,100,2]
[null,null,null,null,5,2.26796,4.53592,null,5,100,null,5,2.26796,57,46,3.6,null,5,2.26796,100,2]
[null,null,null,null,6,2.721552,5.4431039999999999,null,6,100,null,6,2.721552,57,46,3.6,null,6,2.721552,100,2]
[null,null,null,null,7,3.175144,6.3502879999999999,null,7,100,null,7,3.175144,57,46,3.6,null,7,3.175144,100,2]
[null,null,null,null,8,3.628736,7.2574719999999999,null,8,100,null,8,3.628736,57,46,3.6,null,8,3.628736,100,2]
[null,null,null,null,9,4.0823280000000004,8.1646560000000008,null,9,100,null,9,4.0823280000000004,57,46,3.6,null,9,4.0823280000000004,100,2]
[null,null,null,null,10,4.53592,9.0718399999999999,null,10,100,null,10,4.53592,57,46,3.6,null,10,4.53592,100,2]
[null,null,null,null,11,4.9895119999999995,9.979023999999999,null,11,100,null,11,4.9895119999999995,57,46,3.6,null,11,4.9895119999999995,100,2]
[null,null,null,null,12,5.4431039999999999,10.886208,null,12,100,null,12,5.4431039999999999,57,46,3.6,null,12,5.4431039999999999,100,2]
[null,null,null,null,13,5.8966960000000004,11.793392000000001,null,13,100,null,13,5.8966960000000004,57,46,3.6,null,13,5.8966960000000004,100,2]
[null,null,null,null,14,6.3502879999999999,12.700576,null,14,100,null,14,6.3502879999999999,57,46,3.6,null,14,6.3502879999999999,100,2]
[null,null,null,null,15,6.8038799999999995,13.607759999999999,null,15,100,null,15,6.8038799999999995,57,46,3.6,null,15,6.8038799999999995,100,2]
["LUT 1","(from med rad p3t, 300 conc)",null,null,16,7.2574719999999999,14.514944,null,16,100,null,16,7.2574719999999999,57,46,3.6,null,16,7.2574719999999999,100,2]
[0,{"$f":"A25*0.453592","v":0},80,null,17,7.7110640000000004,15.422128000000001,null,17,100,null,17,7.7110640000000004,57,46,3.6,null,17,7.7110640000000004,100,2]
[1,{"$f":"A26*0.453592","v":0.453592},80,null,18,8.1646560000000008,16.329312000000002,null,18,100,null,18,8.1646560000000008,57,46,3.6,null,18,8.1646560000000008,100,2]
[2,0.90718399999999999,80,null,19,8.6182479999999995,17.236495999999999,null,19,100,null,19,8.6182479999999995,57,46,3.6,null,19,8.6182479999999995,100,2]
[3,1.360776,80,null,20,9.0718399999999999,18.14368,null,20,100,null,20,9.0718399999999999,57,46,3.6,null,20,9.0718399999999999,100,2]
[4,1.814368,80,null,21,9.5254320000000003,19.050864000000001,null,21,100,null,21,9.5254320000000003,57,46,3.6,null,21,9.5254320000000003,100,2]
[5,2.26796,80,null,22,9.979023999999999,19.958047999999998,null,22,100,null,22,9.979023999999999,57,46,3.6,null,22,9.979023999999999,100,2]
[6,2.721552,80,null,23,10.432615999999999,20.865231999999999,null,23,100,null,23,10.432615999999999,57,46,3.6,null,23,10.432615999999999,100,2]
[7,3.175144,80,null,24,10.886208,21.772416,null,24,100,null,24,10.886208,57,46,3.6,null,24,10.886208,100,2]
[8,3.628736,80,null,25,11.3398,22.679600000000001,null,25,100,null,25,11.3398,57,46,3.6,null,25,11.3398,100,2]
[9,4.0823280000000004,80,null,26,11.793392000000001,23.586784000000002,null,26,100,null,26,11.793392000000001,57,46,3.6,null,26,11.793392000000001,100,2]
[10,4.53592,80,null,27,12.246983999999999,24.493967999999999,null,27,100,null,27,12.246983999999999,57,46,3.6,null,27,12.246983999999999,100,2]
[11,4.9895119999999995,80,null,28,12.700576,25.401152,null,28,100,null,28,12.700576,57,46,3.6,null,28,12.700576,100,2]
[12,5.4431039999999999,80,null,29,13.154168,26.308336000000001,null,29,100,null,29,13.154168,57,46,3.6,null,29,13.154168,100,2]
[13,5.8966960000000004,80,null,30,13.607759999999999,27.215519999999998,null,30,100,null,30,13.607759999999999,57,46,3.6,null,30,13.607759999999999,100,2]
[14,6.3502879999999999,80,null,31,14.061351999999999,28.122703999999999,null,31,100,null,31,14.061351999999999,57,46,3.6,null,31,14.061351999999999,100,2]
[15,6.8038799999999995,80,null,32,14.514944,29.029888,null,32,100,null,32,14.514944,57,46,3.6,null,32,14.514944,100,2]
[16,7.2574719999999999,80,null,33,14.968536,29.937072000000001,null,33,100,null,33,14.968536,57,46,3.6,null,33,14.968536,100,2]
[17,7.7110640000000004,80,null,34,15.422128000000001,30.844256000000001,null,34,100,null,34,15.422128000000001,57,46,3.6,null,34,15.422128000000001,100,2]
[18,8.1646560000000008,80,null,35,15.875719999999999,31.751439999999999,null,35,100,null,35,15.875719999999999,57,46,3.6,null,35,15.875719999999999,100,2]
[19,8.6182479999999995,80,null,36,16.329312000000002,32.658624000000003,null,36,100,null,36,16.329312000000002,57,46,3.6,null,36,16.329312000000002,100,2]
[20,9.0718399999999999,80,null,37,16.782903999999998,33.565807999999997,null,37,100,null,37,16.782903999999998,57,46,3.6,null,37,16.782903999999998,100,2]
[21,9.5254320000000003,80,null,38,17.236495999999999,34.472991999999998,null,38,100,null,38,17.236495999999999,57,46,3.6,null,38,17.236495999999999,100,2]
[22,9.979023999999999,80,null,39,17.690087999999999,35.380175999999999,null,39,100,null,39,17.690087999999999,57,46,3.6,null,39,17.690087999999999,100,2]
[23,10.432615999999999,80,null,40,18.14368,36.28736,null,40,100,null,40,18.14368,57,46,3.6,null,40,18.14368,100,2]
[24,10.886208,80,null,41,18.597272,37.194544,null,41,100,null,41,18.597272,57,46,3.6,null,41,18.597272,100,2]
[25,11.3398,80,null,42,19.050864000000001,38.101728000000001,null,42,100,null,42,19.050864000000001,57,46,3.6,null,42,19.050864000000001,100,2]
[26,11.793392000000001,80,null,43,19.504456000000001,39.008912000000002,null,43,100,null,43,19.504456000000001,57,46,3.6,null,43,19.504456000000001,100,2]
[27,12.246983999999999,80,null,44,19.958047999999998,39.916095999999996,null,44,100,null,44,19.958047999999998,57,46,3.6,null,44,19.958047999999998,100,2]
[28,12.700576,80,null,45,20.411639999999998,40.823279999999997,null,45,100,null,45,20.411639999999998,57,46,3.6,null,45,20.411639999999998,100,2]
[29,13.154168,80,null,46,20.865231999999999,41.730463999999998,null,46,100,null,46,20.865231999999999,57,46,3.6,null,46,20.865231999999999,100,2]
[30,13.607759999999999,80,null,47,21.318823999999999,42.637647999999999,null,47,100,null,47,21.318823999999999,57,46,3.6,null,47,21.318823999999999,100,2]
[31,14.061351999999999,80,null,48,21.772416,43.544832,null,48,100,null,48,21.772416,57,46,3.6,null,48,21.772416,100,2]
[32,14.514944,80,null,49,22.226008,44.452016,null,49,100,null,49,22.226008,57,46,3.6,null,49,22.226008,100,2]
[33,14.968536,80,null,50,22.679600000000001,45.359200000000001,null,50,100,null,50,22.679600000000001,57,46,3.6,null,50,22.679600000000001,100,2]
[34,15.422128000000001,80,null,51,23.133192000000001,46.266384000000002,null,51,100,null,51,23.133192000000001,57,46,3.6,null,51,23.133192000000001,100,2]
[35,15.875719999999999,80,null,52,23.586784000000002,47.173568000000003,null,52,100,null,52,23.586784000000002,57,46,3.6,null,52,23.586784000000002,100,2]
{"$rows_left_out":366}
{"sheet":"mappings","index":7,"n_rows":102,"n_cols":9,"rows_kept":102,"cut":false,"hidden":false,"merged":[]}
["ranges for each LUT from weight2Volume sheet",null,null,null,null,null,null,"do not edit this column, it is where you link protocols/types with LUT numbers"]
["LUT #","Range","Strength","break point in time (seconds) where volume and rate level off (only populate this field for angio protocols with angio flag = 1)","min time (seconds)below which volume is fixed (only populate if angio flag = 1)",null,null,"Protocol Names/types","LUT #"]
[1,"weight2Volume!b25:c425",300,null,null,null,null,{"$f":"Protocols!A6","v":"Weight Based Routine Adult"},1]
[2,"weight2Volume!f8:g408",300,null,null,null,null,{"$f":"Protocols!A7","v":"Weight Based Routine Ped"},2]
[3,"weight2Volume!i8:j208",370,null,null,null,null,{"$f":"Protocols!A8","v":"Weight Based Angio"},4]
[4,"weight2Volume!m8:p408",350,12,7,null,null,{"$f":"Protocols!A9","v":"U Washington Abdomen"},5]
[5,"weight2Volume!s8:u408",350,null,null,null,null,{"$f":"Protocols!A10","v":0}]
[6,null,null,null,null,null,null,{"$f":"Protocols!A11","v":0}]
[7,null,null,null,null,null,null,{"$f":"Protocols!A12","v":0}]
[8,null,null,null,null,null,null,{"$f":"Protocols!A13","v":0}]
[9,null,null,null,null,null,null,{"$f":"Protocols!A14","v":0}]
[10,null,null,null,null,null,null,{"$f":"Protocols!A15","v":0}]
[11,null,null,null,null,null,null,{"$f":"Protocols!A16","v":0}]
[12,null,null,null,null,null,null,{"$f":"Protocols!A17","v":0}]
[13,null,null,null,null,null,null,{"$f":"Protocols!A18","v":0}]
[14,null,null,null,null,null,null,{"$f":"Protocols!A19","v":0}]
[15,null,null,null,null,null,null,{"$f":"Protocols!A20","v":0}]
[16,null,null,null,null,null,null,{"$f":"Protocols!A21","v":0}]
[17,null,null,null,null,null,null,{"$f":"Protocols!A22","v":0}]
[18,null,null,null,null,null,null,{"$f":"Protocols!A23","v":0}]
[19,null,null,null,null,null,null,{"$f":"Protocols!A24","v":0}]
[20,null,null,null,null,null,null,{"$f":"Protocols!A25","v":0}]
[21,null,null,null,null,null,null,{"$f":"Protocols!A26","v":0}]
[22,null,null,null,null,null,null,{"$f":"Protocols!A27","v":0}]
[23,null,null,null,null,null,null,{"$f":"Protocols!A28","v":0}]
[24,null,null,null,null,null,null,{"$f":"Protocols!A29","v":0}]
[25,null,null,null,null,null,null,{"$f":"Protocols!A30","v":0}]
[26,null,null,null,null,null,null,{"$f":"Protocols!A31","v":0}]
[27,null,null,null,null,null,null,{"$f":"Protocols!A32","v":0}]
[28,null,null,null,null,null,null,{"$f":"Protocols!A33","v":0}]
[29,null,null,null,null,null,null,{"$f":"Protocols!A34","v":0}]
[30,null,null,null,null,null,null,{"$f":"Protocols!A35","v":0}]
[31,null,null,null,null,null,null,{"$f":"Protocols!A36","v":0}]
[32,null,null,null,null,null,null,{"$f":"Protocols!A37","v":0}]
[33,null,null,null,null,null,null,{"$f":"Protocols!A38","v":0}]
[34,null,null,null,null,null,null,{"$f":"Protocols!A39","v":0}]
[35,null,null,null,null,null,null,{"$f":"Protocols!A40","v":0}]
[36,null,null,null,null,null,null,{"$f":"Protocols!A41","v":0}]
[37,null,null,null,null,null,null,{"$f":"Protocols!A42","v":0}]
[38,null,null,null,null,null,null,{"$f":"Protocols!A43","v":0}]
[39,null,null,null,null,null,null,{"$f":"Protocols!A44","v":0}]
[40,null,null,null,null,null,null,{"$f":"Protocols!A45","v":0}]
[41,null,null,null,null,null,null,{"$f":"Protocols!A46","v":0}]
[42,null,null,null,null,null,null,{"$f":"Protocols!A47","v":0}]
[43,null,null,null,null,null,null,{"$f":"Protocols!A48","v":0}]
[44,null,null,null,null,null,null,{"$f":"Protocols!A49","v":0}]
[45,null,null,null,null,null,null,{"$f":"Protocols!A50","v":0}]
[46,null,null,null,null,null,null,{"$f":"Protocols!A51","v":0}]
[47,null,null,null,null,null,null,{"$f":"Protocols!A52","v":0}]
[48,null,null,null,null,null,null,{"$f":"Protocols!A53","v":0}]
[49,null,null,null,null,null,null,{"$f":"Protocols!A54","v":0}]
[50,null,null,null,null,null,null,{"$f":"Protocols!A55","v":0}]
[51,null,null,null,null,null,null,{"$f":"Protocols!A56","v":0}]
[52,null,null,null,null,null,null,{"$f":"Protocols!A57","v":0}]
[53,null,null,null,null,null,null,{"$f":"Protocols!A58","v":0}]
[54,null,null,null,null,null,null,{"$f":"Protocols!A59","v":0}]
[55,null,null,null,null,null,null,{"$f":"Protocols!A60","v":0}]
[56,null,null,null,null,null,null,{"$f":"Protocols!A61","v":0}]
[57,null,null,null,null,null,null,{"$f":"Protocols!A62","v":0}]
[58,null,null,null,null,null,null,{"$f":"Protocols!A63","v":0}]
{"$rows_left_out":43}
{"sheet":"about","index":8,"n_rows":10,"n_cols":2,"rows_kept":10,"cut":false,"hidden":false,"merged":[]}
[]
[]
[null,"need a formal page here for public release"]
[]
[]
[null,"a tim stick production"]
[null,"Megan Lipford, Sean Rose "]
[null,"Carrie Bartels"]
[]
[null,"thanks \"Meghan's\" husband for the ped images!"]